IBM Semeru Runtime Open Edition JDK 8 x64 Version 8.0.504.0
Refer :- https://www.ibm.com/support/pages/semeru-runtimes-release-notes/#version_8$$$* CVEs$$$ - CVE-2026-60589$$$ - CVE-2026-61308$$$ - CVE-2026-70907$$$* Changes$$$ - JDK-8382471: Improve Resource Resolving$$$ - JDK-8384708: Enhance HTTP Connections$$$ - JDK-8385390: Update FreeType to 2.14.3$$$ - JDK-8386205: Enhance TLS server$$$ - JDK-8388811: [8u] VS2010 build broken by JDK-8374058$$$ - JDK-8389477: Bump update version for OpenJDK: 8u504$$$
IBM Semeru Runtime Open Edition JDK 8 x64 Version 8.0.502.0
Refer :- https://www.ibm.com/support/pages/semeru-runtimes-release-notes/#version_8
IBM Semeru Runtime Open Edition JDK 8 x64 Version 8.0.502.0
Refer :- https://www.ibm.com/support/pages/semeru-runtimes-release-notes/#version_8
IBM Semeru Runtime Open Edition JDK 8 x64 Version 8.0.492.9
8.0.492.0$$$$$$Open edition; April 2026$$$IBM Semeru Runtimes Open Edition 8.0.492.0 contains:$$$$$$OpenJDK 8u492 build 9 (release notes; security vulnerabilities; OpenJ9 related changes)$$$OpenJ9 0.59.0 (release notes; security vulnerabilities).$$$OpenSSL 3.5.6. Bundled for all non-z/OS platform builds.
IBM Semeru Runtime Open Edition JDK 8 x64 Version 8.0.492.9
8.0.492.0$$$$$$Open edition; April 2026$$$IBM Semeru Runtimes Open Edition 8.0.492.0 contains:$$$$$$OpenJDK 8u492 build 9 (release notes; security vulnerabilities; OpenJ9 related changes)$$$OpenJ9 0.59.0 (release notes; security vulnerabilities).$$$OpenSSL 3.5.6. Bundled for all non-z/OS platform builds.
IBM Semeru Runtime Open Edition JDK 8 x64 Version 8.0.492.9
8.0.492.0$$$$$$Open edition; April 2026$$$IBM Semeru Runtimes Open Edition 8.0.492.0 contains:$$$$$$OpenJDK 8u492 build 9 (release notes; security vulnerabilities; OpenJ9 related changes)$$$OpenJ9 0.59.0 (release notes; security vulnerabilities).$$$OpenSSL 3.5.6. Bundled for all non-z/OS platform builds.
IBM Semeru Runtime Open Edition JDK 8 x64 Version 8.0.482.8
8.0.482$$$$$$Open edition; January 2026$$$IBM Semeru Runtimes Open Edition 8.0.482 contains:$$$$$$OpenJDK 8u482 build 8 (release notes; security vulnerabilities; OpenJ9 related changes)$$$OpenJ9 0.57.0 (release notes; security vulnerabilities).$$$OpenSSL 3.5.4. Bundled for all non-z/OS platform builds.
IBM Semeru Runtime Open Edition JDK 8 x64 Version 8.0.482.8
8.0.482$$$$$$Open edition; January 2026$$$IBM Semeru Runtimes Open Edition 8.0.482 contains:$$$$$$OpenJDK 8u482 build 8 (release notes; security vulnerabilities; OpenJ9 related changes)$$$OpenJ9 0.57.0 (release notes; security vulnerabilities).$$$OpenSSL 3.5.4. Bundled for all non-z/OS platform builds.
IBM Semeru Runtime Open Edition JDK 8 x64 Version 8.0.472.8
New in release OpenJDK 8u472 (2025-10-21):$$$===========================================$$$Live versions of these release notes can be found at:$$$ * https://bit.ly/openjdk8u472$$$$$$* CVEs$$$ - CVE-2025-53057$$$ - CVE-2025-53066$$$* Changes$$$ - JDK-7102969: currency.properties supercede not working correctly$$$ - JDK-8041924: [TESTBUG] sun/net/www/http/ChunkedOutputStream/checkError.java fails on some systems$$$ - JDK-8044051: Test jdk/lambda/vm/InterfaceAccessFlagsTest.java gets IOException during compilation$$$ - JDK-8056283: @ignore tools/javac/defaultMethods/Assertions.java until JDK-8047675 is fixed$$$ - JDK-8081734: ConcurrentHashMap/ConcurrentAssociateTest.java; times out 90% of time on sparc with 256 cpu.$$$ - JDK-8157138: Error while fetching currency instance by Currency.getInstance(currencycode)$$$ - JDK-8160767: [TEST_BUG] java/awt/Frame/MaximizedToIconified/MaximizedToIconified.java$$$ - JDK-8185348: Major performance regression in GetMethodDeclaringClass and other JVMTI Method functions$$$ - JDK-8185500: [TESTBUG] Add keywords headful/printer in java/awt and javax tests.$$$ - JDK-8186259: IOExceptionIfEncodedURLTest.sh versus IOExceptionIfEncodedURLTest.java$$$ - JDK-8205653: test/jdk/sun/management/jmxremote/bootstrap/RmiRegistrySslTest.java and RmiSslBootstrapTest.sh fail with handshake_failure$$$ - JDK-8228658: test GetTotalSafepointTime.java fails on fast Linux machines with Total safepoint time 0 ms$$$ - JDK-8275303: sun/java2d/pipe/InterpolationQualityTest.java fails with D3D basic render driver$$$ - JDK-8312065: Socket.connect does not timeout when profiling$$$ - JDK-8335978: [8u] incorrect include file name in semaphore.inline.hpp$$$ - JDK-8339414: Fix JDK-8202369 incorrect backport for 8u$$$ - JDK-8340387: Update OS detection code to recognize Windows Server 2025$$$ - JDK-8345414: Google CAInterop test failures$$$ - JDK-8348760: RadioButton is not shown if JRadioButtonMenuItem is rendered with ImageIcon in WindowsLookAndFeel$$$ - JDK-8351624: [8u] Xerces-J version wrong in THIRD_PARTY_README after JDK-7150324$$$ - JDK-8352302: Test sun/security/tools/jarsigner/TimestampCheck.java is failing$$$ - JDK-8352637: Enhance bytecode verification$$$ - JDK-8356294: Enhance Path Factories$$$ - JDK-8358328: Bump update version of OpenJDK: 8u472$$$ - JDK-8358538: Update GHA Windows runner to 2025$$$ - JDK-8360937: Enhance certificate handling$$$ - JDK-8361212: Remove AffirmTrust root CAs$$$ - JDK-8363965: GHA: Switch cross-compiling sysroots to Debian bookworm$$$ - JDK-8365375: Method SU3.setAcceleratorSelectionForeground assigns to acceleratorForeground$$$ - JDK-8365389: Remove static color fields from SwingUtilities3 and WindowsMenuItemUI$$$ - JDK-8365560: [8u] ppc64le MaxRAM default is too low at 4GiB$$$ - JDK-8365811: test/jdk/java/net/CookieHandler/B6644726.java failure - Should have 5 cookies. Got only 4; expires probably didnt parse correctly$$$ - JDK-8366112: [8u] GHA: Fix broken installation of Windows SDK$$$ - JDK-8368308: ISO 4217 Amendment 180 Update$$$$$$Notes on individual issues:$$$===========================$$$$$$security-libs/java.security:$$$$$$JDK-8361212: Remove AffirmTrust root CAs$$$========================================$$$The following root certificates from AffirmTrust; which were$$$deactivated in the 8u432 release of October 2024; have been removed$$$from the `cacerts` keystore:$$$$$$Alias name: affirmtrustcommercialca [jdk]$$$CN=AffirmTrust Commercial$$$O=AffirmTrust$$$C=US$$$SHA256: 03:76:AB:1D:54:C5:F9:80:3C:E4:B2:E2:01:A0:EE:7E:EF:7B:57:B6:36:E8:A9:3C:9B:8D:48:60:C9:6F:5F:A7$$$$$$Alias name: affirmtrustnetworkingca [jdk]$$$CN=AffirmTrust Networking$$$O=AffirmTrust$$$C=US$$$SHA256: 0A:81:EC:5A:92:97:77:F1:45:90:4A:F3:8D:5D:50:9F:66:B5:E2:C5:8F:CD:B5:31:05:8B:0E:17:F3:F0B4:1B$$$$$$Alias name: affirmtrustpremiumca [jdk]$$$CN=AffirmTrust Premium$$$O=AffirmTrust$$$C=US$$$SHA256: 70:A7:3F:7F:37:6B:60:07:42:48:90:45:34:B1:14:82:D5:BF:0E:69:8E:CC:49:8D:F5:25:77:EB:F2:E9:3B:9A$$$$$$Alias name: affirmtrustpremiumeccca [jdk]
IBM Semeru Runtime Open Edition JDK 8 x64 Version 8.0.472.8
New in release OpenJDK 8u472 (2025-10-21):$$$===========================================$$$Live versions of these release notes can be found at:$$$ * https://bit.ly/openjdk8u472$$$$$$* CVEs$$$ - CVE-2025-53057$$$ - CVE-2025-53066$$$* Changes$$$ - JDK-7102969: currency.properties supercede not working correctly$$$ - JDK-8041924: [TESTBUG] sun/net/www/http/ChunkedOutputStream/checkError.java fails on some systems$$$ - JDK-8044051: Test jdk/lambda/vm/InterfaceAccessFlagsTest.java gets IOException during compilation$$$ - JDK-8056283: @ignore tools/javac/defaultMethods/Assertions.java until JDK-8047675 is fixed$$$ - JDK-8081734: ConcurrentHashMap/ConcurrentAssociateTest.java; times out 90% of time on sparc with 256 cpu.$$$ - JDK-8157138: Error while fetching currency instance by Currency.getInstance(currencycode)$$$ - JDK-8160767: [TEST_BUG] java/awt/Frame/MaximizedToIconified/MaximizedToIconified.java$$$ - JDK-8185348: Major performance regression in GetMethodDeclaringClass and other JVMTI Method functions$$$ - JDK-8185500: [TESTBUG] Add keywords headful/printer in java/awt and javax tests.$$$ - JDK-8186259: IOExceptionIfEncodedURLTest.sh versus IOExceptionIfEncodedURLTest.java$$$ - JDK-8205653: test/jdk/sun/management/jmxremote/bootstrap/RmiRegistrySslTest.java and RmiSslBootstrapTest.sh fail with handshake_failure$$$ - JDK-8228658: test GetTotalSafepointTime.java fails on fast Linux machines with Total safepoint time 0 ms$$$ - JDK-8275303: sun/java2d/pipe/InterpolationQualityTest.java fails with D3D basic render driver$$$ - JDK-8312065: Socket.connect does not timeout when profiling$$$ - JDK-8335978: [8u] incorrect include file name in semaphore.inline.hpp$$$ - JDK-8339414: Fix JDK-8202369 incorrect backport for 8u$$$ - JDK-8340387: Update OS detection code to recognize Windows Server 2025$$$ - JDK-8345414: Google CAInterop test failures$$$ - JDK-8348760: RadioButton is not shown if JRadioButtonMenuItem is rendered with ImageIcon in WindowsLookAndFeel$$$ - JDK-8351624: [8u] Xerces-J version wrong in THIRD_PARTY_README after JDK-7150324$$$ - JDK-8352302: Test sun/security/tools/jarsigner/TimestampCheck.java is failing$$$ - JDK-8352637: Enhance bytecode verification$$$ - JDK-8356294: Enhance Path Factories$$$ - JDK-8358328: Bump update version of OpenJDK: 8u472$$$ - JDK-8358538: Update GHA Windows runner to 2025$$$ - JDK-8360937: Enhance certificate handling$$$ - JDK-8361212: Remove AffirmTrust root CAs$$$ - JDK-8363965: GHA: Switch cross-compiling sysroots to Debian bookworm$$$ - JDK-8365375: Method SU3.setAcceleratorSelectionForeground assigns to acceleratorForeground$$$ - JDK-8365389: Remove static color fields from SwingUtilities3 and WindowsMenuItemUI$$$ - JDK-8365560: [8u] ppc64le MaxRAM default is too low at 4GiB$$$ - JDK-8365811: test/jdk/java/net/CookieHandler/B6644726.java failure - Should have 5 cookies. Got only 4; expires probably didnt parse correctly$$$ - JDK-8366112: [8u] GHA: Fix broken installation of Windows SDK$$$ - JDK-8368308: ISO 4217 Amendment 180 Update$$$$$$Notes on individual issues:$$$===========================$$$$$$security-libs/java.security:$$$$$$JDK-8361212: Remove AffirmTrust root CAs$$$========================================$$$The following root certificates from AffirmTrust; which were$$$deactivated in the 8u432 release of October 2024; have been removed$$$from the `cacerts` keystore:$$$$$$Alias name: affirmtrustcommercialca [jdk]$$$CN=AffirmTrust Commercial$$$O=AffirmTrust$$$C=US$$$SHA256: 03:76:AB:1D:54:C5:F9:80:3C:E4:B2:E2:01:A0:EE:7E:EF:7B:57:B6:36:E8:A9:3C:9B:8D:48:60:C9:6F:5F:A7$$$$$$Alias name: affirmtrustnetworkingca [jdk]$$$CN=AffirmTrust Networking$$$O=AffirmTrust$$$C=US$$$SHA256: 0A:81:EC:5A:92:97:77:F1:45:90:4A:F3:8D:5D:50:9F:66:B5:E2:C5:8F:CD:B5:31:05:8B:0E:17:F3:F0B4:1B$$$$$$Alias name: affirmtrustpremiumca [jdk]$$$CN=AffirmTrust Premium$$$O=AffirmTrust$$$C=US$$$SHA256: 70:A7:3F:7F:37:6B:60:07:42:48:90:45:34:B1:14:82:D5:BF:0E:69:8E:CC:49:8D:F5:25:77:EB:F2:E9:3B:9A$$$$$$Alias name: affirmtrustpremiumeccca [jdk]
IBM Semeru Runtime Open Edition JDK 8 x64 Version 8.0.462.8
New in release OpenJDK 8u462 (2025-07-15):$$$===========================================$$$* CVEs$$$ - CVE-2025-30749$$$ - CVE-2025-30754$$$ - CVE-2025-30761$$$ - CVE-2025-50106$$$* Changes$$$ - JDK-8026976: ECParameters; Point does not match field size$$$ - JDK-8028998: [TEST_BUG] [macosx] java/awt/dnd/DropTargetEnterExitTest/MissedDragExitTest.java failed$$$ - JDK-8046883: com/sun/jdi/ProcessAttachTest.sh gets java.io.IOException: Invalid process identifier on windows$$$ - JDK-8071996: split_if accesses NULL region of ConstraintCast$$$ - JDK-8159694: HiDPI; Unity; java/awt/dnd/DropTargetEnterExitTest/MissedDragExitTest.java$$$ - JDK-8186143: keytool -ext option doesnt accept wildcards for DNS subject alternative names$$$ - JDK-8186787: clang-4.0 SIGSEGV in Unsafe_PutByte$$$ - JDK-8248001: javadoc generates invalid HTML pages whose ftp:// links are broken$$$ - JDK-8274597: Some of the dnd tests time out and fail intermittently$$$ - JDK-8274606: Fix jaxp/javax/xml/jaxp/unittest/transform/SurrogateTest.java test$$$ - JDK-8278472: Invalid value set to CANDIDATEFORM structure$$$ - JDK-8293107: GHA: Bump to Ubuntu 22.04$$$ - JDK-8296631: NSS tests failing on OL9 linux-aarch64 hosts$$$ - JDK-8303770: Remove Baltimore root certificate expiring in May 2025$$$ - JDK-8341946: [8u] sun/security/pkcs11/ec/ tests fail on RHEL9$$$ - JDK-8345133: Test sun/security/tools/jarsigner/TsacertOptionTest.java failed: Warning found in stdout$$$ - JDK-8345625: Better HTTP connections$$$ - JDK-8346887: DrawFocusRect() may cause an assertion failure$$$ - JDK-8348989: Better Glyph drawing$$$ - JDK-8349111: Enhance Swing supports$$$ - JDK-8349594: Enhance TLS protocol support$$$ - JDK-8350498: Remove two Camerfirma root CA certificates$$$ - JDK-8351098: Bump update version of OpenJDK: 8u462$$$ - JDK-8351422: Improve scripting supports$$$ - JDK-8351439: [8u] test/java/util/TimeZone/tools/share/Makefile use wrong path to tzdb$$$ - JDK-8352716: (tz) Update Timezone Data to 2025b$$$ - JDK-8356096: ISO 4217 Amendment 179 Update$$$ - JDK-8359170: Add 2 TLS and 2 CS Sectigo roots$$$ - JDK-8360147: Better Glyph drawing redux$$$$$$Refer for more details - https://mail.openjdk.org/pipermail/jdk8u-dev/2025-July/020263.html
IBM Semeru Runtime Open Edition JDK 8 x64 Version 8.0.462.8
New in release OpenJDK 8u462 (2025-07-15):$$$===========================================$$$* CVEs$$$ - CVE-2025-30749$$$ - CVE-2025-30754$$$ - CVE-2025-30761$$$ - CVE-2025-50106$$$* Changes$$$ - JDK-8026976: ECParameters; Point does not match field size$$$ - JDK-8028998: [TEST_BUG] [macosx] java/awt/dnd/DropTargetEnterExitTest/MissedDragExitTest.java failed$$$ - JDK-8046883: com/sun/jdi/ProcessAttachTest.sh gets java.io.IOException: Invalid process identifier on windows$$$ - JDK-8071996: split_if accesses NULL region of ConstraintCast$$$ - JDK-8159694: HiDPI; Unity; java/awt/dnd/DropTargetEnterExitTest/MissedDragExitTest.java$$$ - JDK-8186143: keytool -ext option doesnt accept wildcards for DNS subject alternative names$$$ - JDK-8186787: clang-4.0 SIGSEGV in Unsafe_PutByte$$$ - JDK-8248001: javadoc generates invalid HTML pages whose ftp:// links are broken$$$ - JDK-8274597: Some of the dnd tests time out and fail intermittently$$$ - JDK-8274606: Fix jaxp/javax/xml/jaxp/unittest/transform/SurrogateTest.java test$$$ - JDK-8278472: Invalid value set to CANDIDATEFORM structure$$$ - JDK-8293107: GHA: Bump to Ubuntu 22.04$$$ - JDK-8296631: NSS tests failing on OL9 linux-aarch64 hosts$$$ - JDK-8303770: Remove Baltimore root certificate expiring in May 2025$$$ - JDK-8341946: [8u] sun/security/pkcs11/ec/ tests fail on RHEL9$$$ - JDK-8345133: Test sun/security/tools/jarsigner/TsacertOptionTest.java failed: Warning found in stdout$$$ - JDK-8345625: Better HTTP connections$$$ - JDK-8346887: DrawFocusRect() may cause an assertion failure$$$ - JDK-8348989: Better Glyph drawing$$$ - JDK-8349111: Enhance Swing supports$$$ - JDK-8349594: Enhance TLS protocol support$$$ - JDK-8350498: Remove two Camerfirma root CA certificates$$$ - JDK-8351098: Bump update version of OpenJDK: 8u462$$$ - JDK-8351422: Improve scripting supports$$$ - JDK-8351439: [8u] test/java/util/TimeZone/tools/share/Makefile use wrong path to tzdb$$$ - JDK-8352716: (tz) Update Timezone Data to 2025b$$$ - JDK-8356096: ISO 4217 Amendment 179 Update$$$ - JDK-8359170: Add 2 TLS and 2 CS Sectigo roots$$$ - JDK-8360147: Better Glyph drawing redux$$$$$$Refer for more details - https://mail.openjdk.org/pipermail/jdk8u-dev/2025-July/020263.html
IBM Semeru Runtime Open Edition JDK 8 x64 Version 8.0.452.9
* CVEs$$$ - CVE-2025-21587$$$ - CVE-2025-30691$$$ - CVE-2025-30698$$$* Changes$$$ - JDK-8037013: [TESTBUG] Fix test/java/lang/ClassLoader/Assert.sh on AIX$$$ - JDK-8048215: [TESTBUG] java/lang/management/ManagementFactory/ThreadMXBeanProxy.java Expected non-null LockInfo$$$ - JDK-8068305: [TEST_BUG] Test java/awt/Mixing/HWDisappear.java fails with GTKL&F$$$ - JDK-8212096: javax/net/ssl/ServerName/SSLEngineExplorerMatchedSNI.java failed intermittently due to SSLException: Tag mismatch$$$ - JDK-8227651: Tests fail with SSLProtocolException: Input record too big$$$ - JDK-8240235: jdk.test.lib.util.JarUtils updates jar files incorrectly$$$ - JDK-8244966: Add .vscode to .hgignore and .gitignore$$$ - JDK-8250825: C2 crashes with assert(field != __null) failed: missing field$$$ - JDK-8255466: C2 crashes at ciObject::get_oop() const+0x0$$$ - JDK-8261020: Wrong format parameter in create_emergency_chunk_path$$$ - JDK-8265019: Update tests for additional TestNG test permissions$$$ - JDK-8266881: Enable debug log for SSLEngineExplorerMatchedSNI.java$$$ - JDK-8268457: XML Transformer outputs Unicode supplementary character incorrectly to HTML$$$ - JDK-8285756: clean up use of bad arguments for `@clean` in langtools tests$$$ - JDK-8309841: Jarsigner should print a warning if an entry is removed$$$ - JDK-8316193: jdk/jfr/event/oldobject/TestListenerLeak.java java.lang.Exception: Could not find leak$$$ - JDK-8326110: [8u] The Marlin tests should be updated after JDK-8241307$$$ - JDK-8337494: Clarify JarInputStream behavior$$$ - JDK-8337692: Better TLS connection support$$$ - JDK-8338430: Improve compiler transformations$$$ - JDK-8339560: Unaddressed comments during code review of JDK-8337664$$$ - JDK-8339637: (tz) Update Timezone Data to 2024b$$$ - JDK-8339644: Improve parsing of Day/Month in tzdata rules$$$ - JDK-8339810: Clean up the code in sun.tools.jar.Main to properly close resources and use ZipFile during extract$$$ - JDK-8340552: Harden TzdbZoneRulesCompiler against missing zone names$$$ - JDK-8340660: [8u] Test com/sun/jdi/PrivateTransportTest.sh fails on MacOS$$$ - JDK-8342562: Enhance Deflater operations$$$ - JDK-8343007: Enhance Buffered Image handling$$$ - JDK-8345504: Bump update version of OpenJDK: 8u452$$$ - JDK-8346140: [8u] tools/jar/ExtractFilesTest.java and tools/jar/MultipleManifestTest.java fails with jtreg5.1$$$ - JDK-8346587: Distrust TLS server certificates anchored by Camerfirma Root CAs$$$ - JDK-8347847: Enhance jar file support$$$ - JDK-8347965: (tz) Update Timezone Data to 2025a$$$ - JDK-8348211: [8u] sun/management/jmxremote/startstop/JMXStartStopTest.java fails after backport of JDK-8066708$$$ - JDK-8349166: Bad indentation in backport of JDK-8250825$$$ - JDK-8350816: [8u] Update TzdbZoneRulesCompiler to ignore HST/EST/MST links$$$ - JDK-8352097: (tz) zone.tab update missed in 2025a backport$$$ - JDK-8353433: XCG currency code not recognized in JDK 8u
IBM Semeru Runtime Open Edition JDK 8 x64 Version 8.0.452.9
* CVEs$$$ - CVE-2025-21587$$$ - CVE-2025-30691$$$ - CVE-2025-30698$$$* Changes$$$ - JDK-8037013: [TESTBUG] Fix test/java/lang/ClassLoader/Assert.sh on AIX$$$ - JDK-8048215: [TESTBUG] java/lang/management/ManagementFactory/ThreadMXBeanProxy.java Expected non-null LockInfo$$$ - JDK-8068305: [TEST_BUG] Test java/awt/Mixing/HWDisappear.java fails with GTKL&F$$$ - JDK-8212096: javax/net/ssl/ServerName/SSLEngineExplorerMatchedSNI.java failed intermittently due to SSLException: Tag mismatch$$$ - JDK-8227651: Tests fail with SSLProtocolException: Input record too big$$$ - JDK-8240235: jdk.test.lib.util.JarUtils updates jar files incorrectly$$$ - JDK-8244966: Add .vscode to .hgignore and .gitignore$$$ - JDK-8250825: C2 crashes with assert(field != __null) failed: missing field$$$ - JDK-8255466: C2 crashes at ciObject::get_oop() const+0x0$$$ - JDK-8261020: Wrong format parameter in create_emergency_chunk_path$$$ - JDK-8265019: Update tests for additional TestNG test permissions$$$ - JDK-8266881: Enable debug log for SSLEngineExplorerMatchedSNI.java$$$ - JDK-8268457: XML Transformer outputs Unicode supplementary character incorrectly to HTML$$$ - JDK-8285756: clean up use of bad arguments for `@clean` in langtools tests$$$ - JDK-8309841: Jarsigner should print a warning if an entry is removed$$$ - JDK-8316193: jdk/jfr/event/oldobject/TestListenerLeak.java java.lang.Exception: Could not find leak$$$ - JDK-8326110: [8u] The Marlin tests should be updated after JDK-8241307$$$ - JDK-8337494: Clarify JarInputStream behavior$$$ - JDK-8337692: Better TLS connection support$$$ - JDK-8338430: Improve compiler transformations$$$ - JDK-8339560: Unaddressed comments during code review of JDK-8337664$$$ - JDK-8339637: (tz) Update Timezone Data to 2024b$$$ - JDK-8339644: Improve parsing of Day/Month in tzdata rules$$$ - JDK-8339810: Clean up the code in sun.tools.jar.Main to properly close resources and use ZipFile during extract$$$ - JDK-8340552: Harden TzdbZoneRulesCompiler against missing zone names$$$ - JDK-8340660: [8u] Test com/sun/jdi/PrivateTransportTest.sh fails on MacOS$$$ - JDK-8342562: Enhance Deflater operations$$$ - JDK-8343007: Enhance Buffered Image handling$$$ - JDK-8345504: Bump update version of OpenJDK: 8u452$$$ - JDK-8346140: [8u] tools/jar/ExtractFilesTest.java and tools/jar/MultipleManifestTest.java fails with jtreg5.1$$$ - JDK-8346587: Distrust TLS server certificates anchored by Camerfirma Root CAs$$$ - JDK-8347847: Enhance jar file support$$$ - JDK-8347965: (tz) Update Timezone Data to 2025a$$$ - JDK-8348211: [8u] sun/management/jmxremote/startstop/JMXStartStopTest.java fails after backport of JDK-8066708$$$ - JDK-8349166: Bad indentation in backport of JDK-8250825$$$ - JDK-8350816: [8u] Update TzdbZoneRulesCompiler to ignore HST/EST/MST links$$$ - JDK-8352097: (tz) zone.tab update missed in 2025a backport$$$ - JDK-8353433: XCG currency code not recognized in JDK 8u
IBM Semeru Runtime Open Edition JDK 8 x64 Version 8.0.442.6
February 2025$$$IBM Semeru Runtimes Open Edition 8.0.442 contains:$$$$$$OpenJDK 8u442 build 6 (release notes; security vulnerabilities; OpenJ9 related changes)$$$OpenJ9 0.49.0 (release notes; security vulnerabilities).$$$Removal of root CA certificates$$$Three root CA certificates have been removed from this Semeru release compared to the equivalent Eclipse Temurin release:$$$Alias name: cn=entrust_root_certification_authority_-_g4;ou=(c)_2015_entrust__inc._-_for_authorized_use_only;ou=see_www.entrust.net/legal-terms;o=entrust__inc.;c=us$$$Alias name: cn=securesign_rootca11;o=japan_certification_services__inc.;c=jp$$$Alias name: cn=security_communication_rootca3;o=secom_trust_systems_co._ltd.;c=jp
IBM Semeru Runtime Open Edition JDK 8 x64 Version 8.0.432.6
Refer - https://mail.openjdk.org/pipermail/jdk8u-dev/2024-October/019414.html
IBM Semeru Runtime Open Edition JDK 8 x64 Version 8.0.422.5
Refer - https://mail.openjdk.org/pipermail/jdk8u-dev/2024-July/018910.html
IBM Semeru Runtime Open Edition JDK 8 x64 Version 8.0.412.8
Not yet updated by Vendor.
IBM Semeru Runtime Open Edition JDK 8 x64 Version 8.0.402.6
8.0.402.0$$$$$$Open edition; February 2024$$$IBM Semeru Runtimes Open Edition 8.0.402.0 contains:$$$$$$OpenJDK 8.0.402.0 build 6 (release notes; security vulnerabilities OpenJ9 related changes)$$$OpenJ9 0.43 (release notes; security vulnerabilities).
IBM Semeru Runtime Open Edition JDK 8 x64 Version 8.0.392.8
8.0.392.0$$$$$$Open edition; October 2023$$$IBM Semeru Runtimes Open Edition 8.0.392.0 contains:$$$$$$OpenJDK 8.0.392.0 build 8 (release highlights; security vulnerabilities OpenJ9 related changes)$$$OpenJ9 0.41 (release notes; security vulnerabilities).
IBM Semeru Runtime Open Edition JDK 8 x64 Version 8.0.382.5
Refer-https://www.ibm.com/support/pages/semeru-runtimes-release-notes/
IBM Semeru Runtime Open Edition JDK 8 x64 Version 8.0.372.7
Refer-https://www.ibm.com/support/pages/semeru-runtimes-release-notes/
IBM Semeru Runtime Open Edition JDK 8 x64 Version 8.0.372.7
Refer-https://www.ibm.com/support/pages/semeru-runtimes-release-notes/
IBM Semeru Runtime Open Edition JDK 8 x64 Version 8.0.372.7
Refer-https://www.ibm.com/support/pages/semeru-runtimes-release-notes/
IBM Semeru Runtime Open Edition JDK 8 x64 Version 8.0.372.7
Refer-https://www.ibm.com/support/pages/semeru-runtimes-release-notes/
IBM Semeru Runtime Open Edition JDK 8 x64 Version 8.0.372.7
Refer-https://www.ibm.com/support/pages/semeru-runtimes-release-notes/
IBM Semeru Runtime Open Edition JDK 8 x64 Version 8.0.372.7
Refer-https://www.ibm.com/support/pages/semeru-runtimes-release-notes/
IBM Semeru Runtime Open Edition JDK 8 x64 Version 8.0.372.7
Refer-https://www.ibm.com/support/pages/semeru-runtimes-release-notes/